{"text_format":"1","workbook":"xlsx","n_sheets":6,"sheets":["GV-Berechnung-Gülleanfall","Mist- Trockenkotanfall","förderfähiger Anteil","Finanzierungsplan","Ranking","Stammdaten-Tierhaltung"],"not_rendered":{"charts":0,"images":1,"macros":1,"external_links":0,"defined_names":9,"comments":0,"pivot_tables":0},"unopened":[],"bounds":{"document_bytes":16777216,"sheet_cells":100000,"rows_first":2000,"rows_last":500,"rows_between":2000,"halvings":0,"cell_chars":16384,"cell_head_chars":4096},"cells_cut":0,"cells_raw":0,"read":"whole","date_system":"1900"}

{"sheet":"GV-Berechnung-Gülleanfall","index":0,"n_rows":66,"n_cols":27,"rows_kept":66,"cut":false,"hidden":false,"merged":[[24,9,24,11],[16,2,16,4],[17,2,17,4],[16,5,16,6],[17,5,17,6],[18,5,18,6],[19,7,19,8],[19,5,19,6],[20,5,20,6],[21,5,21,6],[18,7,18,8],[20,2,20,4],[21,2,21,4],[15,7,15,8],[19,2,19,4],[16,15,16,17],[17,15,17,17],[18,15,18,17],[19,15,19,17],[0,0,0,18],[6,3,6,5],[6,6,6,7],[10,15,10,17],[11,15,11,17],[12,15,12,17],[13,15,13,17],[15,15,15,17],[15,12,15,14],[16,12,16,14],[17,12,17,14],[18,2,18,4],[10,2,10,4],[11,2,11,4],[12,2,12,4],[13,2,13,4],[14,2,14,4],[15,5,15,6],[15,2,15,4],[13,7,13,8],[18,12,18,14],[19,12,19,14],[10,12,10,14],[23,2,23,4],[22,5,22,6],[23,5,23,6],[21,12,21,14],[22,12,22,14],[16,9,16,11],[17,9,17,11],[18,9,18,11],[19,9,19,11],[20,12,20,14],[10,9,10,11],[11,9,11,11],[12,9,12,11],[13,9,13,11],[16,7,16,8],[17,7,17,8],[14,9,14,11],[15,9,15,11],[12,7,12,8],[22,15,22,17],[23,15,23,17],[21,15,21,17],[23,7,23,8],[23,9,23,11],[21,7,21,8],[23,12,23,14],[22,2,22,4],[20,15,20,17],[22,7,22,8],[22,9,22,11],[21,9,21,11],[20,7,20,8],[20,9,20,11],[6,14,6,17],[6,11,6,13],[6,8,6,10],[3,0,3,17],[14,12,14,14],[9,12,9,17],[9,9,9,11],[12,5,12,6],[13,5,13,6],[14,5,14,6],[9,2,9,8],[10,5,10,8],[11,5,11,8],[14,7,14,8],[11,12,11,14],[12,12,12,14],[13,12,13,14],[14,15,14,17],[24,12,24,14],[24,15,24,17],[26,12,26,14],[27,12,27,14],[28,12,28,14],[29,12,29,14],[26,15,26,17],[28,15,28,17],[29,15,29,17],[25,12,25,14],[25,15,25,17],[41,2,41,4],[42,2,42,4],[43,2,43,4],[46,2,46,4],[27,9,27,11],[31,12,31,14],[31,15,31,17],[32,12,32,14],[32,15,32,17],[27,15,27,17],[30,15,30,17],[44,2,44,4],[45,2,45,4],[38,2,38,4],[44,6,44,17],[48,2,48,4],[41,6,42,17],[45,6,46,17],[28,2,28,4],[29,2,29,4],[30,2,30,4],[31,2,31,4],[32,2,32,4],[33,2,33,4],[33,12,33,14],[39,2,39,4],[40,2,40,4],[38,6,40,17],[33,15,33,17],[35,12,35,14],[35,15,35,17],[35,5,35,7],[34,2,34,4],[34,5,34,7],[34,15,34,17],[35,2,35,4],[47,2,47,4],[36,12,36,14],[36,15,36,17],[53,14,53,16],[50,14,50,16],[51,14,51,16],[34,12,34,14],[28,5,28,7],[29,5,29,7],[30,5,30,7],[31,5,31,7],[32,5,32,7],[33,5,33,7],[30,12,30,14]]}
["Berechnung der Großvieheinheiten und der Lagerkapazität"]
["für flüssige Wirtschaftsdünger"]
[null,null,null,null,null,null,null,null,null,null,null,null,null,null,null,null,null,null,null,null,null,"--"]
[null,null,null,null,null,null,null,null,null,null,null,null,null,null,null,null,null,null,null,null,null,"Stall"]
["Antragstellendes Unternehmen (Name, Vorname, ggf. Unternehmensbezeichnung)",null,null,null,null,null,null,null,null,null,null,null,null,null,null,null,null,null,null,null,null,"Weide"]
[null,null,null,"EU-Registriernummer",null,null,null,null,null,null,null,null,null,null,null,null,null,null,null,null,null,"Tagweide"]
[null,null,null,"Nation",null,null,"BL",null,"LK",null,null,"Gemeinde",null,null,"Betrieb"]
[null,null,null,2,7,6,"0",3]
[]
["Tierhaltung","Aufstallung1)","Ø Jahresbestand2)",null,null,null,null,null,null,"GVE3)",null,null,"Lagerraumbedarf4)"]
[null,null,"Gülle",null,null,"Mist / Jauche",null,null,null,null,null,null,"6 Monate",null,null,"9 Monate"]
[null,null,null,null,null,"Einstreumenge"]
[null,null,null,null,null,"niedrig",null,"hoch",null,null,null,null,"Menge",null,null,"Menge"]
[null,null,"Anzahl",null,null,"Anzahl",null,"Anzahl",null,null,null,null,"m3",null,null,"m3",null,null,null,null,null,"Gülle","Jauche","GVE","12 Monate","Mist","Dichte"]
[{"$f":"INDEX(Tierart,$T15)","v":"--"},{"$f":"IF($T15=1,\" --\",INDEX(Weide,$U15))","v":" --"},0,null,null,0,null,0,null,{"$f":"($C15+$F15+$H15)*X15","v":0},null,null,{"$f":"($C15*$V15/2)+($F15*$W15/2)","v":0},null,null,{"$f":"IF($U15=1,($C15*$V15/12)*9,IF($U15=2,($C15*$V15/12)*7,$C15*$V15/12*8))+IF($U15=1,($F15*$W15/12)*9,IF($U15=2,($F15*$W15/12)*7,$F15*$W15/12*8))","v":0},null,null,1,1,1,{"$f":"INDEX(Gülleanfall,'GV-Berechnung-Gülleanfall'!$T15)","v":0},{"$f":"INDEX(Jaucheanfall,'GV-Berechnung-Gülleanfall'!$T15)","v":0},{"$f":"INDEX(GVE,'GV-Berechnung-Gülleanfall'!$T15)","v":0},{"$f":"IF($U15=1,($C15*$V15/12)*12,IF($U15=2,($C15*$V15/12)*7,$C15*$V15/12*9.5))+IF($U15=1,($F15*$W15/12)*12,IF($U15=2,($F15*$W15/12)*7,$F15*$W15/12*9.5))","v":0},{"$f":"INDEX(Mistanfall,'GV-Berechnung-Gülleanfall'!$T15)","v":0},{"$f":"INDEX(MistDichte,'GV-Berechnung-Gülleanfall'!$T15)","v":0}]
["--"," --",0,null,null,0,null,0,null,0,null,null,0,null,null,0,null,null,1,1,1,{"$f":"INDEX(Gülleanfall,'GV-Berechnung-Gülleanfall'!$T16)","v":0},{"$f":"INDEX(Jaucheanfall,'GV-Berechnung-Gülleanfall'!$T16)","v":0},{"$f":"INDEX(GVE,'GV-Berechnung-Gülleanfall'!$T16)","v":0},{"$f":"IF($U16=1,($C16*$V16/12)*12,IF($U16=2,($C16*$V16/12)*7,$C16*$V16/12*9.5))+IF($U16=1,($F16*$W16/12)*12,IF($U16=2,($F16*$W16/12)*7,$F16*$W16/12*9.5))","v":0},{"$f":"INDEX(Mistanfall,'GV-Berechnung-Gülleanfall'!$T16)","v":0},{"$f":"INDEX(MistDichte,'GV-Berechnung-Gülleanfall'!$T16)","v":0}]
["--"," --",0,null,null,0,null,0,null,0,null,null,0,null,null,0,null,null,1,1,1,{"$f":"INDEX(Gülleanfall,'GV-Berechnung-Gülleanfall'!$T17)","v":0},{"$f":"INDEX(Jaucheanfall,'GV-Berechnung-Gülleanfall'!$T17)","v":0},{"$f":"INDEX(GVE,'GV-Berechnung-Gülleanfall'!$T17)","v":0},0,{"$f":"INDEX(Mistanfall,'GV-Berechnung-Gülleanfall'!$T17)","v":0},{"$f":"INDEX(MistDichte,'GV-Berechnung-Gülleanfall'!$T17)","v":0}]
["--"," --",0,null,null,0,null,0,null,0,null,null,0,null,null,0,null,null,1,1,1,{"$f":"INDEX(Gülleanfall,'GV-Berechnung-Gülleanfall'!$T18)","v":0},{"$f":"INDEX(Jaucheanfall,'GV-Berechnung-Gülleanfall'!$T18)","v":0},{"$f":"INDEX(GVE,'GV-Berechnung-Gülleanfall'!$T18)","v":0},0,{"$f":"INDEX(Mistanfall,'GV-Berechnung-Gülleanfall'!$T18)","v":0},{"$f":"INDEX(MistDichte,'GV-Berechnung-Gülleanfall'!$T18)","v":0}]
["--"," --",0,null,null,0,null,0,null,0,null,null,0,null,null,0,null,null,1,1,1,{"$f":"INDEX(Gülleanfall,'GV-Berechnung-Gülleanfall'!$T19)","v":0},{"$f":"INDEX(Jaucheanfall,'GV-Berechnung-Gülleanfall'!$T19)","v":0},{"$f":"INDEX(GVE,'GV-Berechnung-Gülleanfall'!$T19)","v":0},0,{"$f":"INDEX(Mistanfall,'GV-Berechnung-Gülleanfall'!$T19)","v":0},{"$f":"INDEX(MistDichte,'GV-Berechnung-Gülleanfall'!$T19)","v":0}]
["--"," --",0,null,null,0,null,0,null,0,null,null,0,null,null,0,null,null,1,1,1,{"$f":"INDEX(Gülleanfall,'GV-Berechnung-Gülleanfall'!$T20)","v":0},{"$f":"INDEX(Jaucheanfall,'GV-Berechnung-Gülleanfall'!$T20)","v":0},{"$f":"INDEX(GVE,'GV-Berechnung-Gülleanfall'!$T20)","v":0},0,{"$f":"INDEX(Mistanfall,'GV-Berechnung-Gülleanfall'!$T20)","v":0},{"$f":"INDEX(MistDichte,'GV-Berechnung-Gülleanfall'!$T20)","v":0}]
{"$rows_left_out":47}
{"sheet":"Mist- Trockenkotanfall","index":1,"n_rows":64,"n_cols":18,"rows_kept":64,"cut":false,"hidden":false,"merged":[[22,2,22,4],[22,5,22,7],[22,8,22,10],[20,2,20,4],[20,5,20,7],[20,8,20,10],[21,2,21,4],[21,5,21,7],[21,8,21,10],[18,2,18,4],[18,5,18,7],[18,8,18,10],[19,2,19,4],[19,5,19,7],[19,8,19,10],[16,2,16,4],[16,5,16,7],[16,8,16,10],[17,2,17,4],[17,5,17,7],[17,8,17,10],[14,2,14,4],[14,5,14,7],[14,8,14,10],[15,2,15,4],[15,5,15,7],[15,8,15,10],[12,2,12,4],[12,5,12,7],[12,8,12,10],[13,2,13,4],[13,5,13,7],[13,8,13,10],[10,8,10,10],[11,2,11,4],[11,5,11,7],[11,8,11,10],[10,2,10,7],[3,0,3,17],[6,3,6,5],[6,6,6,7],[6,8,6,10],[6,11,6,13],[6,14,6,17],[28,2,28,4],[25,5,25,7],[26,5,26,7],[27,5,27,7],[28,5,28,7],[23,2,23,4],[23,5,23,7],[25,2,25,4],[26,2,26,4],[27,2,27,4]]}
["Berechnung des Mist- bzw. Trockenkotanfalls *"]
[]
[]
[{"$f":"'GV-Berechnung-Gülleanfall'!A4:R4","v":0}]
["Antragstellendes Unternehmen (Name, Vorname, ggf. Unternehmensbezeichnung)"]
[null,null,null,"EU-Registriernummer"]
[null,null,null,"Nation",null,null,"BL",null,"LK",null,null,"Gemeinde",null,null,"Betrieb"]
[null,null,null,2,7,6,"0",3,{"$f":"'GV-Berechnung-Gülleanfall'!I8","v":0},{"$f":"'GV-Berechnung-Gülleanfall'!J8","v":0},{"$f":"'GV-Berechnung-Gülleanfall'!K8","v":0},{"$f":"'GV-Berechnung-Gülleanfall'!L8","v":0},{"$f":"'GV-Berechnung-Gülleanfall'!M8","v":0},{"$f":"'GV-Berechnung-Gülleanfall'!N8","v":0},{"$f":"'GV-Berechnung-Gülleanfall'!O8","v":0},{"$f":"'GV-Berechnung-Gülleanfall'!P8","v":0},{"$f":"'GV-Berechnung-Gülleanfall'!Q8","v":0},{"$f":"'GV-Berechnung-Gülleanfall'!R8","v":0}]
[]
[]
["Tierhaltung",null,"Anfall2) 3)"]
[null,"Anzahl1)","m³ / Monat",null,null,"t / Monat"]
[{"$f":"'GV-Berechnung-Gülleanfall'!A15","v":"--"},{"$f":"'GV-Berechnung-Gülleanfall'!F15+'GV-Berechnung-Gülleanfall'!H15","v":0},{"$f":"B13*'GV-Berechnung-Gülleanfall'!Z15/12","v":0},null,null,{"$f":"IFERROR(C13/'GV-Berechnung-Gülleanfall'!AA15,0)","v":0}]
[{"$f":"'GV-Berechnung-Gülleanfall'!A16","v":"--"},{"$f":"'GV-Berechnung-Gülleanfall'!F16+'GV-Berechnung-Gülleanfall'!H16","v":0},{"$f":"B14*'GV-Berechnung-Gülleanfall'!Z16/12","v":0},null,null,{"$f":"IFERROR(C14/'GV-Berechnung-Gülleanfall'!AA16,0)","v":0}]
[{"$f":"'GV-Berechnung-Gülleanfall'!A17","v":"--"},{"$f":"'GV-Berechnung-Gülleanfall'!F17+'GV-Berechnung-Gülleanfall'!H17","v":0},{"$f":"B15*'GV-Berechnung-Gülleanfall'!Z17/12","v":0},null,null,{"$f":"IFERROR(C15/'GV-Berechnung-Gülleanfall'!AA17,0)","v":0}]
[{"$f":"'GV-Berechnung-Gülleanfall'!A18","v":"--"},{"$f":"'GV-Berechnung-Gülleanfall'!F18+'GV-Berechnung-Gülleanfall'!H18","v":0},{"$f":"B16*'GV-Berechnung-Gülleanfall'!Z18/12","v":0},null,null,{"$f":"IFERROR(C16/'GV-Berechnung-Gülleanfall'!AA18,0)","v":0}]
[{"$f":"'GV-Berechnung-Gülleanfall'!A19","v":"--"},{"$f":"'GV-Berechnung-Gülleanfall'!F19+'GV-Berechnung-Gülleanfall'!H19","v":0},{"$f":"B17*'GV-Berechnung-Gülleanfall'!Z19/12","v":0},null,null,{"$f":"IFERROR(C17/'GV-Berechnung-Gülleanfall'!AA19,0)","v":0}]
[{"$f":"'GV-Berechnung-Gülleanfall'!A20","v":"--"},{"$f":"'GV-Berechnung-Gülleanfall'!F20+'GV-Berechnung-Gülleanfall'!H20","v":0},{"$f":"B18*'GV-Berechnung-Gülleanfall'!Z20/12","v":0},null,null,{"$f":"IFERROR(C18/'GV-Berechnung-Gülleanfall'!AA20,0)","v":0}]
[{"$f":"'GV-Berechnung-Gülleanfall'!A21","v":"--"},{"$f":"'GV-Berechnung-Gülleanfall'!F21+'GV-Berechnung-Gülleanfall'!H21","v":0},{"$f":"B19*'GV-Berechnung-Gülleanfall'!Z21/12","v":0},null,null,{"$f":"IFERROR(C19/'GV-Berechnung-Gülleanfall'!AA21,0)","v":0}]
[{"$f":"'GV-Berechnung-Gülleanfall'!A22","v":"--"},{"$f":"'GV-Berechnung-Gülleanfall'!F22+'GV-Berechnung-Gülleanfall'!H22","v":0},{"$f":"B20*'GV-Berechnung-Gülleanfall'!Z22/12","v":0},null,null,{"$f":"IFERROR(C20/'GV-Berechnung-Gülleanfall'!AA22,0)","v":0}]
{"$rows_left_out":45}
{"sheet":"förderfähiger Anteil","index":2,"n_rows":60,"n_cols":22,"rows_kept":60,"cut":false,"hidden":false,"merged":[[35,3,35,4],[4,0,4,17],[7,3,7,5],[7,6,7,7],[7,8,7,10],[7,11,7,13],[7,14,7,17]]}
["Förderung von Investitionen zur Verbesserung "]
["des Nährstoffeinsatzes (IVN)"]
["Wirtschaftsdüngerlager Berechnung des förderfähigen Anteils *"]
[]
[{"$f":"'GV-Berechnung-Gülleanfall'!A4:R4","v":0},null,null,null,null,null,null,null,null,null,null,null,null,null,null,null,null,null,null,"WDL für Tierhaltung",1]
["Antragstellendes Unternehmen (Name, Vorname, ggf. Unternehmensbezeichnung)",null,null,null,null,null,null,null,null,null,null,null,null,null,null,null,null,null,null,"WDL als Düngerlager",2]
[null,null,null,"EU-Registriernummer"]
[null,null,null,"Nation",null,null,"BL",null,"LK",null,null,"Gemeinde",null,null,"Betrieb"]
[null,null,null,2,7,6,"0",3,{"$f":"'GV-Berechnung-Gülleanfall'!I8","v":0},{"$f":"'GV-Berechnung-Gülleanfall'!J8","v":0},{"$f":"'GV-Berechnung-Gülleanfall'!K8","v":0},{"$f":"'GV-Berechnung-Gülleanfall'!L8","v":0},{"$f":"'GV-Berechnung-Gülleanfall'!M8","v":0},{"$f":"'GV-Berechnung-Gülleanfall'!N8","v":0},{"$f":"'GV-Berechnung-Gülleanfall'!O8","v":0},{"$f":"'GV-Berechnung-Gülleanfall'!P8","v":0},{"$f":"'GV-Berechnung-Gülleanfall'!Q8","v":0},{"$f":"'GV-Berechnung-Gülleanfall'!R8","v":0}]
[]
[]
["Berechnungsgrundlage:"]
[]
[{"$f":"IF(U14=1,T5,T6)","v":"WDL für Tierhaltung"},null,null,null,null,null,null,null,null,null,null,null,null,null,null,null,null,null,null,null,1]
[]
["landwirtschaftlich genutzte Fläche",{"$f":"'GV-Berechnung-Gülleanfall'!B55","v":0},"ha"]
["Besatzdichte",{"$f":"'GV-Berechnung-Gülleanfall'!X45","v":0},"GV/ha"]
["Lager für flüssige Wirtschaftsdünger"]
[]
["vorhandene Lagerstätten:",{"$f":"'GV-Berechnung-Gülleanfall'!Y54","v":0},"m³"]
{"$rows_left_out":41}
{"sheet":"Finanzierungsplan","index":3,"n_rows":35,"n_cols":19,"rows_kept":35,"cut":false,"hidden":false,"merged":[[9,1,10,1],[3,0,3,18],[6,4,6,6],[6,7,6,8],[6,9,6,11],[6,12,6,14],[6,15,6,18],[9,3,9,6],[10,3,10,6],[11,3,11,6],[12,3,12,6],[11,16,11,18],[12,16,12,18],[12,13,12,15],[13,3,13,6],[14,3,14,6],[13,16,13,18],[14,16,14,18],[13,13,13,15],[14,13,14,15],[14,10,14,12],[13,10,13,12],[21,15,21,18],[22,3,22,6],[15,3,15,6],[23,3,23,6],[23,7,23,10],[23,11,23,14],[23,15,23,18],[18,3,18,6],[20,3,20,6],[20,7,20,10],[20,11,20,14],[20,15,20,18],[17,3,17,6],[16,3,16,6],[21,3,21,6],[21,7,21,10],[24,15,24,18],[25,3,25,6],[25,7,25,10],[25,11,25,14],[25,15,25,18],[24,3,24,6],[24,7,24,10],[24,11,24,14],[26,15,26,18],[27,3,27,6],[27,7,27,10],[27,11,27,14],[27,15,27,18],[26,3,26,6],[26,7,26,10],[26,11,26,14],[21,11,21,14],[17,13,17,15],[18,13,18,15],[19,13,19,15],[9,16,9,18],[10,16,10,18],[9,13,9,15],[10,13,10,15],[11,13,11,15],[15,16,15,18],[16,16,16,18],[17,16,17,18],[18,16,18,18],[19,16,19,18],[11,10,11,12],[12,10,12,12],[15,13,15,15],[16,13,16,15],[15,10,15,12],[16,10,16,12],[17,10,17,12],[18,10,18,12],[9,7,9,9],[10,7,10,9],[11,7,11,9],[12,7,12,9],[13,7,13,9],[14,7,14,9],[15,7,15,9],[16,7,16,9],[18,7,18,9],[17,7,17,9],[9,10,9,12],[10,10,10,12]]}
["Förderung von Investitionen zur Verbesserung des Nährstoffeinsatzes (IVN)"]
["Berechnung der Fördermittel und Finanzierungsplan"]
[]
[{"$f":"'GV-Berechnung-Gülleanfall'!A4:R4","v":0}]
["Antragstellendes Unternehmen (Name, Vorname, ggf. Unternehmensbezeichnung)"]
[null,null,null,null,"EU-Registriernummer"]
[null,null,null,null,"Nation",null,null,"BL",null,"LK",null,null,"Gemeinde",null,null,"Betrieb"]
[null,null,null,null,2,7,6,"0",3,{"$f":"'GV-Berechnung-Gülleanfall'!I8","v":0},{"$f":"'GV-Berechnung-Gülleanfall'!J8","v":0},{"$f":"'GV-Berechnung-Gülleanfall'!K8","v":0},{"$f":"'GV-Berechnung-Gülleanfall'!L8","v":0},{"$f":"'GV-Berechnung-Gülleanfall'!M8","v":0},{"$f":"'GV-Berechnung-Gülleanfall'!N8","v":0},{"$f":"'GV-Berechnung-Gülleanfall'!O8","v":0},{"$f":"'GV-Berechnung-Gülleanfall'!P8","v":0},{"$f":"'GV-Berechnung-Gülleanfall'!Q8","v":0},{"$f":"'GV-Berechnung-Gülleanfall'!R8","v":0}]
[]
["Finanzierungsbedarf 1)","Beschreibung des\n Teilvorhabens \n(Ausführung, Größe, etc)","Investitions-volumen\n incl. MWSt.","nicht förderfähiger Betrag ",null,null,null," nicht förderfähige MWSt.",null,null,"förderfähig. Investitions- volumen ",null,null,"förderfähiger Anteil 2)",null,null,"förderfähiger Betrag"]
[null,null,"EUR","EUR",null,null,null,"EUR",null,null,"EUR",null,null,"%",null,null,"EUR"]
["separater Gülle-/ Jauchebehälter 3)",null,null,null,null,null,null,null,null,null,{"$f":"C12-D12-H12","v":0},null,null,{"$f":"'förderfähiger Anteil'!B27","v":0},null,null,{"$f":"K12*N12/100","v":0}]
["Festmistplatte 3)",null,null,null,null,null,null,null,null,null,0,null,null,{"$f":"'förderfähiger Anteil'!B42","v":0},null,null,0]
["Betreuung des Antragsverfahrens 4)",null,null,null,null,null,null,null,null,null,0,null,null,100,null,null,0]
["Abdeckung besteh. Lagerstätten 3)",null,0,0,null,null,null,null,null,null,0,null,null,100,null,null,0]
["Gülleaufbereitungsanlagen",null,null,null,null,null,null,null,null,null,0,null,null,100,null,null,0]
["digitale Landtechnik",null,0,null,null,null,null,null,null,null,{"$f":"C17-D17-H17","v":0},null,null,100,null,null,{"$f":"K17*N17/100","v":0}]
["Baugenehmigung, Statikprüfung 5)"]
["Gesamtkosten 6)",null,{"$f":"SUM(C12:C18)","v":0},{"$f":"SUM(D12:G17)","v":0},null,null,null,{"$f":"SUM(H12:J17)","v":0},null,null,{"$f":"SUM(K12:M17)","v":0},null,null,null,null,null,{"$f":"SUM(Q12:S17)","v":0}]
["Beantragte Fördermittel (Fördersatz 35 %, max. 70.000,- EUR)",null,null,null,null,null,null,null,null,null,null,null,null,null,null,null,{"$f":"IF('förderfähiger Anteil'!B17>3,0,IF(Q19>200000,70000,IF(Q19<10000,0,Q19*0.35)))","v":0}]
{"$rows_left_out":16}
{"sheet":"Ranking","index":4,"n_rows":49,"n_cols":22,"rows_kept":49,"cut":false,"hidden":false,"merged":[[21,5,21,6],[17,4,17,6],[18,4,18,6],[19,4,19,6],[20,4,20,6],[16,4,16,7],[4,0,4,16],[7,3,7,5],[7,6,7,7],[7,8,7,10],[7,11,7,13],[7,14,7,16]]}
["Förderung von Investitionen zur Verbesserung "]
["des Nährstoffeinsatzes (IVN)"]
["Ranking"]
[]
[{"$f":"'GV-Berechnung-Gülleanfall'!A4:R4","v":0}]
["Antragstellendes Unternehmen (Name, Vorname, ggf. Unternehmensbezeichnung)"]
[null,null,null,"EU-Registriernummer"]
[null,null,null,"Nation",null,null,"BL",null,"LK",null,null,"Gemeinde",null,null,"Betrieb"]
[null,null,null,2,7,6,"0",3,{"$f":"'GV-Berechnung-Gülleanfall'!I8","v":0},{"$f":"'GV-Berechnung-Gülleanfall'!J8","v":0},{"$f":"'GV-Berechnung-Gülleanfall'!K8","v":0},{"$f":"'GV-Berechnung-Gülleanfall'!L8","v":0},{"$f":"'GV-Berechnung-Gülleanfall'!M8","v":0},{"$f":"'GV-Berechnung-Gülleanfall'!N8","v":0},{"$f":"'GV-Berechnung-Gülleanfall'!O8","v":0},{"$f":"'GV-Berechnung-Gülleanfall'!P8","v":0},{"$f":"'GV-Berechnung-Gülleanfall'!Q8","v":0},{"$f":"'GV-Berechnung-Gülleanfall'!R8","v":0}]
[]
[]
["Ermittlung der Bearbeitungs- und Bewilligungsreihenfolge:"]
[null,null,null,null,null,null,null,null,null,null,null,null,null,null,null,null,null,null,null,"Summe","Teilbereich","Nummer"]
["Schwerpunkt ist der Teilbereich:",null,null,null,{"$f":"V19","v":1},{"$f":"U19","v":"separate Wirtschaftsdüngerlager"},null,null,null,null,null,null,null,null,null,null,null,null,null,{"$f":"Finanzierungsplan!N12+Finanzierungsplan!Q13","v":0},"separate Wirtschaftsdüngerlager",1]
[null,null,null,null,null,null,null,null,null,null,null,null,null,null,null,null,null,null,null,{"$f":"Finanzierungsplan!Q15","v":0},"Abdeckung besteh. Lagerstätten",2]
["Ranking:",null,null,null,null,null,null,null,null,null,null,null,null,null,null,null,null,null,null,{"$f":"Finanzierungsplan!Q16","v":0},"Gülleaufbereitungsanlagen",3]
[null,null,null,null,"GV/ha",null,null,null,null,null,null,null,null,null,null,null,null,null,null,{"$f":"Finanzierungsplan!Q17","v":0},"digitale Landtechnik",4]
[]
["Viehbesatz (GV/ha LF)",null,null,null,{"$f":"'GV-Berechnung-Gülleanfall'!X45","v":0},null,null,null,null,null,null,null,null,null,null,null,null,null,null,{"$f":"MAX(T14:T17)","v":0},{"$f":"VLOOKUP(T19,T14:V17,2,FALSE)","v":"separate Wirtschaftsdüngerlager"},{"$f":"VLOOKUP(T19,T14:V17,3,FALSE)","v":1}]
["Junglandwirt: 1) 2)",null,null,null,{"$f":"IF(S20=FALSE,0,-0.2)","v":0},null,null,null,null,null,null,null,null,null,null,null,null,null,false]
{"$rows_left_out":30}
{"sheet":"Stammdaten-Tierhaltung","index":5,"n_rows":68,"n_cols":6,"rows_kept":68,"cut":false,"hidden":false,"merged":[[0,1,0,3]]}
[null,"Anfall Volumen\nanfall\nm³/Stallpl."]
["Tierart",null,null,"Mist /","Lagerungs-"]
[null,"Gülle","Jauche","Trockenkot","dichte - Mist","GV-Schlüssel"]
[null,"m³","m³","m³","m³ / t","gem. DüV"]
["--"]
["Milchkuh, Laufstall, 6000 kg Milch p.a.",27,14,18,1.25,1]
["Milchkuh, Laufstall, 8000 kg Milch p.a.",28,14.4,18.8,1.25,1]
["Milchkuh, Laufstall, 10000 kg Milch p.a.",29,14.8,20,1.25,1]
["Milchkuh, Laufstall, 12000 kg Milch p.a.",30,15.2,21.3,1.25,1]
["Milchkuh, Anbind., 6000 kg Milch p.a.",21.4,8.4,18,1.25,1]
["Milchkuh, Anbind., 8000 kg Milch p.a.",22.4,8.8000000000000007,18.8,1.25,1]
["Milchkuh, Anbind., 10000 kg Milch p.a.",23.4,9.1999999999999993,20,1.25,1]
["Milchkuh, Anbind., 12000 kg Milch p.a.",24.4,9.6,21.3,1.25,1]
["Färsen über 24 Monate",14.1,3.6,15.1,1.25,1]
["Jungrinder weiblich (13 - 24 Monate)",11.4,2.9,12.3,1.25,0.7]
["Jungrinder weiblich (7 - 12 Monate)",7.4,1.9,8,1.25,0.3]
["Kalb (0 - 6 Monate)",4.5999999999999996,1.2,4.9000000000000004,1.25,0.3]
["Mutterkuh 500 kg LM",16,5.5,15,1.25,1]
["Mutterkuh 700 kg LM",20,6,19.8,1.25,1]
["--"]
{"$rows_left_out":48}